컴파일 할 때 오류 cannot find -lcurses

by 아주가끔은 posted Oct 08, 2009
http://www.cubrid.com/reference_ad.html?getUrl=http://dev.naver.com/projects/cubrid/download/downloading?file_id=500

src.rpm을 받아 빌드 해보고 있는데, 아래에서 막힙니다. ncurses-devel 은 설치 되어 있습니다.

/bin/sh ../libtool --tag=CC --mode=link gcc -m32  -ggdb -O2 -DNDEBUG -finline-functions -Wall -W -Wwrite-strings -Wno-cast-qual -Wmissing-prototypes -Wredundant-decls -Wextra -Wlong-long -Wno-unused -I/usr/lib/jvm/java/include -I/usr/lib/jvm/java/include/linux  ../external/lib/liblzo2.la -o cub_broker -lcurses ../cs/libcubridcs.la ../cas/libcascci.la broker.o broker_shm.o broker_error.o broker_util.o broker_process_size.o broker_max_heap.o broker_access_list.o broker_send_fd.o broker_filename.o  -lgcrypt -lstdc++ -lpthread -ldl -lm                                               
mkdir .libs                                                                                                         
gcc -m32 -ggdb -O2 -DNDEBUG -finline-functions -Wall -W -Wwrite-strings -Wno-cast-qual -Wmissing-prototypes -Wredundant-decls -Wextra -Wlong-long -Wno-unused -I/usr/lib/jvm/java/include -I/usr/lib/jvm/java/include/linux -o .libs/cub_broker broker.o broker_shm.o broker_error.o broker_util.o broker_process_size.o broker_max_heap.o broker_access_list.o broker_send_fd.o broker_filename.o  /usr/src/packages/BUILD/cubrid-8.2.0.1150/external/lib/liblzo2.a -lcurses ../cs/.libs/libcubridcs.so -L/usr/src/packages/BUILD/cubrid-8.2.0.1150/cas -lcas -lncurses ../cas/.libs/libcascci.so -lgcrypt -lstdc++ -lpthread -ldl -lm  -Wl,--rpath -Wl,/var/tmp/CUBRID-8.2.0.1150-build/opt/cubrid/lib                     
/usr/lib/gcc/i586-suse-linux/4.3/../../../../i586-suse-linux/bin/ld: cannot find -lcurses                           
collect2: ld returned 1 exit status                                                                                 
make[2]: *** [cub_broker] 오류 1                                                                                    
make[2]: Leaving directory `/usr/src/packages/BUILD/cubrid-8.2.0.1150/broker'                                       
make[1]: *** [all-recursive] 오류 1                                                                                 
make[1]: Leaving directory `/usr/src/packages/BUILD/cubrid-8.2.0.1150'                                              
make: *** [all] 오류 2

Articles

12 13 14 15 16 17 18 19 20 21